Comitati genitori
type: Concept
preferred label: associações de pais @pt-pt
preferred label: Eltern @de
preferred label: parent organisation @en-gb
preferred label: Parents d'élèves @fr
preferred label: 保護者会 @ja-jp
preferred label: asociaciones de apoderados @es
definition: Grupos de pais organizados para apoiar escolas. @pt-pt
definition: 学校をサポートするため設立された保護者のグループ @ja-jp
definition: Grupos de padres organizados para apoyar las escuelas. @es
definition: Groupe de parents d'élèves réunis en association @fr
definition: Elterngruppen, die sich für die Schule engagieren. @de
definition: Gruppi di genitori istituiti per collaborare con l'attività scolastica
definition: Groups of parents set up to support schools @en-gb
note: nessuno
in scheme: subjectcode
created: 2000-10-30T12:00:00+00:00
modified: 2010-12-15T17:01:09+00:00
broader: http://cv.iptc.org/newscodes/subjectcode/05000000