Scuola Infanzia
type: Concept
preferred label: Vorschule/Kindergarten @de
preferred label: 幼児教育 @ja-jp
preferred label: pré-escolar @pt-pt
preferred label: preescolar @es
preferred label: preschool @en-gb
preferred label: Préscolaire @fr
definition: Erziehung für Kinder unterhalb des nationalen regulären Schulalters. @de
definition: Educação para crianças abaixo da idade da escolaridade obrigatória. @pt-pt
definition: Education for children under the national compulsory education age @en-gb
definition: Istruzione dei bambini al di sotto dell'età scolare; Scuola Materna
definition: Educación para niños bajo el sistema escolar. @es
definition: L'enseignement en maternelle, avant l'âge de l'école obligatoire @fr
definition: 国の義務教育を受ける年齢に満たない子供たちのための教育 @ja-jp
note: nessuno
in scheme: subjectcode
created: 2000-10-30T12:00:00+00:00
modified: 2010-12-15T17:01:09+00:00
broader: http://cv.iptc.org/newscodes/subjectcode/05000000