Scuola
type: Concept
preferred label: écoles, collèges, lycées @fr
preferred label: 学校 @ja-jp
preferred label: escolas @pt-pt
preferred label: Schule @de
preferred label: escuelas @es
preferred label: school @en-gb
definition: Un inmueble o institución donde educación de distintas clases es brindada. @es
definition: Edifício ou instituição onde educação de vários níveis é fornecida. @pt-pt
definition: Istituzione che garantisce formazione e istruzione a vari livelli
definition: A building or institution in which education of various sorts is provided @en-gb
definition: L'endroit où est dispensé l'enseignement aux élèves @fr
definition: 様々な形の教育を提供する建物や団体 @ja-jp
definition: Gebäude oder Einrichtung, wo verschiedenartige Ausbildung angeboten wird. @de
note: nessuno
in scheme: subjectcode
created: 2000-10-30T12:00:00+00:00
modified: 2010-12-15T17:01:09+00:00
broader: http://cv.iptc.org/newscodes/subjectcode/05000000
narrower: http://cv.iptc.org/newscodes/subjectcode/05005001
narrower: http://cv.iptc.org/newscodes/subjectcode/05005002
narrower: http://cv.iptc.org/newscodes/subjectcode/05005003