escolas de ensino fundamental, 6ª à 9ª série
type: Concept
preferred label: Collège @fr
preferred label: escuela intermedia @es
preferred label: Haupt- und Realschule @de
preferred label: escolas de 2.º ciclo e 3.º ciclo
preferred label: middle schools @en-gb
preferred label: 中学校 @ja-jp
preferred label: Secondarie di 1.grado, Medie @it
definition: Le collège (élèves entre l'école primaire et le lycée, entre 11 et 14 ans en général) @fr
definition: Schule für die Altersgruppe der 11 bis 15-jährigen. @de
definition: Escola de transição, anterior à escola de ensino médio, entre 10 e 15 anos.
definition: Escola de transição, entre as escolas de 1.º ciclo e as escolas secundárias, entre 10 e 15 anos.
definition: Escuela entre básica, intermedia y liceo, 12 hasta 13 años. @es
definition: Transitional school between elementary and high school, 12 through 13 years of age @en-gb
definition: Livello di istruzione scolastica tra le elementari e le medie superiori, generalmente tra gli 11 e i 14 anni di età @it
definition: 12歳から13歳までの年齢の時に小学校と高校の間に通う過渡的な学校 @ja-jp
note: nessuno @it
in scheme: subjectcode
created: 2003-04-05T12:00:00+00:00
modified: 2012-07-10T12:00:00+00:00
broader: http://cv.iptc.org/newscodes/subjectcode/05005000