Sindacati Scuola
type: Concept
preferred label: Syndicats d'enseignants @fr
preferred label: 教員組合 @ja-jp
preferred label: Lehrer @de
preferred label: sindicatos de professores @pt-br
preferred label: sindicatos de docentes @es
preferred label: teachers union @en-gb
definition: Organizzazioni sindacali dei lavoratori della scuola
definition: Organização de professores para negociações coletivas e outros propósitos relativos à profissão. @pt-br
definition: Organisation der Lehrenden für gemeinsame Vereinbarungen und andere Zwecke. @de
definition: Organizaciones gremiales de profesores para la negociación y otros propositos. @es
definition: Le syndicat des professeurs @fr
definition: 団体交渉および他の目的のための教師の組織 @ja-jp
definition: Organization of teachers for collective bargaining and other purposes @en-gb
note: nessuno
in scheme: subjectcode
created: 2000-10-30T12:00:00+00:00
modified: 2010-12-15T17:01:09+00:00
broad match: http://cv.iptc.org/newscodes/mediatopic/20000536
broader: http://cv.iptc.org/newscodes/subjectcode/05000000