universidades
type: Concept
preferred label: Université @fr
preferred label: Hochschule @de
preferred label: universidad @es
preferred label: 大学 @ja-jp
preferred label: university @en-gb
preferred label: Università @it
definition: Institutions of higher learning capable of providing doctorate degrees @en-gb
definition: Institución de enseñanza superior capaz de proveer grados en doctorado. @es
definition: Instituições de ensino superior capazes de atribuir grau de doutoramento.
definition: Instituições de ensino superior capazes de atribuir grau de doutorado.
definition: L'enseignement supérieur jusqu'au doctorat @fr
definition: 博士号を提供することができる高度の教育施設 @ja-jp
definition: Livello di istruzione superiore per il conseguimento di diplomi di laurea e dottorati; Accademie; Conservatori @it
definition: Institutionen der Lehre auf höherer Ebene, geeignet um Doktoren- und Professorentitel etc. zu verleihen. @de
note: nessuno @it
in scheme: subjectcode
created: 2000-10-30T12:00:00+00:00
modified: 2010-12-15T17:01:09+00:00
broader: http://cv.iptc.org/newscodes/subjectcode/05000000