Esame Ammissione
type: Concept
preferred label: exame de admissão @pt-br
preferred label: entrance examination @en-gb
preferred label: examen de admisión @es
preferred label: Aufnahmeprüfung/Abschluss @de
preferred label: 入試 @ja-jp
preferred label: Examen ou concours d'entrée @fr
definition: Les examens d'entrée du collège à l'université et l'enseignement préparatoire à l'entrée aux grandes écoles @fr
definition: Exames de admissão para universidades, institutos superiores e outras instituições de ensino. @pt-pt
definition: 名門学校の入学のための試験に準備している学生を援助する塾を含み、大学、高校、中学、そしてすべての他の高級または低級の教育機関に入学するための試験 @ja-jp
definition: Exams for entering colleges, universities, junior and senior high schools, and all other higher and lower education institutes, including cram schools, which help students prepare for exams for entry to prestigious schools. @en-gb
definition: Exámenes de admisión a colegios, universidades, institutos y a todas las instituciones de educación escolar y técnico profesional, incluyendo institutos de preparación para entrar a mejores universidades. @es
definition: Prüfungen für die Aufnahme ins Gymnasium, zur Universität, Fachhochschulen und allen anderen höheren und niedrigen Bildungseinrichtungen, inklusive Vorbereitungseinrichtungen, die den Schülern bei der Examensvorbereitung helfen oder bei anderen Prüfungen. @de
definition: Esame necessario per essere ammessi alla frequenza di corsi di istruzione di vario livello, incluso l'insegnamento preparatorio per l'ingresso in scuole prestigiose
note: nessuno
in scheme: subjectcode
created: 2000-10-30T12:00:00+00:00
modified: 2010-12-15T17:01:09+00:00
broader: http://cv.iptc.org/newscodes/subjectcode/05000000