Insegnamento, Apprendimento
type: Concept
preferred label: Pédagogie @fr
preferred label: 授業・学習 @ja-jp
preferred label: ensino @pt-pt
preferred label: Lehren und Lernen @de
preferred label: teaching and learning @en-gb
preferred label: enseñanza y aprendizaje @es
definition: Les deux bouts de l'équation scolaire : enseigner et apprendre @fr
definition: Either end of the education equation @en-gb
definition: Beide Eckpfeiler des Gleichgewichts in der Ausbildung. @de
definition: Os dois objetivos da equação escolar: ensinar e aprender. @pt-br
definition: どちらも教育上同一視するという目的(学習指導法) @ja-jp
definition: Entrambi i termini di riferimento dell'Istruzione
definition: Finalizar la Educación @es
note: nessuno
in scheme: subjectcode
created: 2003-04-05T12:00:00+00:00
modified: 2012-07-10T12:00:00+00:00
broader: http://cv.iptc.org/newscodes/subjectcode/05000000
narrower: http://cv.iptc.org/newscodes/subjectcode/05010001
narrower: http://cv.iptc.org/newscodes/subjectcode/05010002
narrower: http://cv.iptc.org/newscodes/subjectcode/05010003
narrower: http://cv.iptc.org/newscodes/subjectcode/05010004