Studente
type: Concept
preferred label: alunos @pt-br
preferred label: 学生 @ja-jp
preferred label: Student @de
preferred label: students @en-gb
preferred label: étudiants @fr
preferred label: estudiantes @es
definition: Pessoas de todas as idades em ambiente estruturado, não necessariamente uma sala de aula, para aprender alguma coisa. @pt-br
definition: Gente de cualquier edad en un entorno estructurado, no necesariamente en una sala de clases, para aprender algo. @es
definition: Chi riceve un insegnamento da una istituzione e secondo un determinato programma
definition: Menschen jeden Alters die sich in einer strukturellen Umgebung befinden, nicht notwendigerweise ein Klassenraum, um etwas zu lernen. @de
definition: 必ずしも教室は必要ではなく、何かを学ぶために組織だった環境にいる様々な年代の人々 @ja-jp
definition: Les gens de tous âges qui recoivent un enseignement @fr
definition: People of any age in a structured environment, not necessarily a classroom, in order to learn something @en-gb
note: nessuno
in scheme: subjectcode
created: 2003-04-05T12:00:00+00:00
modified: 2012-07-10T12:00:00+00:00
broader: http://cv.iptc.org/newscodes/subjectcode/05010000