Insegnante
type: Concept
preferred label: Lehrender @de
preferred label: Enseignants @fr
preferred label: teachers @en-gb
preferred label: professores @pt-br
preferred label: 教師 @ja-jp
preferred label: profesores @es
definition: Menschen, die ihr Wissen anderen vermitteln. @de
definition: Pessoas dotadas de conhecimento e de meios e técnicas para o transmitir a outros. @pt-pt
definition: People with knowledge who can impart that knowledge to others @en-gb
definition: Chi trasmette una conoscenza agli studenti
definition: 知識をもち、その知識を他の人に伝えることができる人々 @ja-jp
definition: Personas con conocimiento que pueden impartir conocimiento a otros. @es
definition: Les gens chargés de transmettre leur savoir aux élèves @fr
note: nessuno
in scheme: subjectcode
created: 2003-04-05T12:00:00+00:00
modified: 2012-07-10T12:00:00+00:00
broader: http://cv.iptc.org/newscodes/subjectcode/05010000