educação religiosa
type: Concept
preferred label: Educação religiosa
preferred label: Istruzione religiosa @it
preferred label: religious education @en-gb
preferred label: educación religiosa @es
preferred label: Education religieuse @fr
preferred label: Religionserziehung @de
preferred label: 宗教教育 @ja-jp
definition: Einführung durch Gläubige in eine bestimmte oder andere Glaubensrichtungen, oft aber nicht immer in Schulen durch religiöse Institutionen. @de
definition: Instruction religieuse ou à propos des religions habituellement dispensées par les diverses confessions @fr
definition: Instruction by any faith, in that faith or about other faiths, usually, but not always, conducted in schools run by religious bodies @en-gb
definition: 宗教団体が運営する学校で教えられるもの(とは限らないが)という意味での信仰に基づく教育 @ja-jp
definition: Instrução religiosa ou a propósito de religiões, geralmente, mas não sempre, ministrada em escolas dirigidas por religiosos.
definition: instrucción dada por una fé, sobre esa fé o cualquier otra fé, usualmente, pero no siempre, realizada en escuelas dirigidas por religiosos. @es
definition: Istruzione e formazione di tipo religioso, generalmente trasmessa in scuole gestite da corpi religiosi @it
note: nessuno @it
in scheme: subjectcode
created: 2004-04-22T12:00:00+00:00
modified: 2012-07-10T12:00:00+00:00
broader: http://cv.iptc.org/newscodes/subjectcode/05000000
narrower: http://cv.iptc.org/newscodes/subjectcode/05011001
narrower: http://cv.iptc.org/newscodes/subjectcode/05011002
narrower: http://cv.iptc.org/newscodes/subjectcode/05011003
narrower: http://cv.iptc.org/newscodes/subjectcode/05011004