Scuole Talmudiche
type: Concept
preferred label: yeshiva @en-gb
preferred label: yeshivá @pt-pt
preferred label: Yeshiva @fr
preferred label: ユダヤ神学校 @ja-jp
preferred label: Jeschiva @de
definition: Schule die ausgerichtet ist Rabbis auszubilden. @de
definition: Istituti di formazione rabbinica
definition: ラビ(ユダヤ教の聖職者)を養成するための学校 @ja-jp
definition: A school for training rabbis @en-gb
definition: Es una escuela que forma Rabinos. @es
definition: Escola que forma rabinos. @pt-pt
definition: Ecole pour former des rabbins @fr
note: nessuno
in scheme: subjectcode
created: 2004-04-22T12:00:00+00:00
modified: 2012-07-10T12:00:00+00:00
broader: http://cv.iptc.org/newscodes/subjectcode/05011000
broad match: http://cv.iptc.org/newscodes/mediatopic/20000399