Ambiente
type: Concept
preferred label: Environnement @fr
preferred label: 環境 @ja-jp
preferred label: ambiente @pt-pt
preferred label: medio ambiente @es
preferred label: Umwelt @de
preferred label: environmental issue @en-gb
definition: Condizione dell'ecosistema del pianeta, protezione e danni
definition: Todos os aspectos relativos a proteção, estragos e preservação do ecossistema do planeta Terra e de seu ambiente. @pt-br
definition: 惑星地球、およびその環境の生態系の保護、損害、および状態の全ての面 @ja-jp
definition: Tous les aspects de la protection et de la préservation de l'écosystème et de son environnement @fr
definition: All aspects of protection, damage, and condition of the ecosystem of the planet earth and its surroundings. @en-gb
definition: Alle Aspekte des Schutzes, der Zerstörung und die Bedingungen des Ökosystems der Erde und ihrer Umgebung. @de
definition: Todos os aspetos relativos a proteção, estragos e preservação do ecossistema do planeta Terra e do seu ambiente. @pt-pt
definition: Todos los aspectos de protección, daño y condiciones del ecosistema del planeta tierra y sus alrededores. @es
note: nessuno
in scheme: subjectcode
created: 2000-10-30T12:00:00+00:00
modified: 2010-12-15T17:01:09+00:00
narrower: http://cv.iptc.org/newscodes/subjectcode/06001000
narrower: http://cv.iptc.org/newscodes/subjectcode/06002000
narrower: http://cv.iptc.org/newscodes/subjectcode/06003000
narrower: http://cv.iptc.org/newscodes/subjectcode/06004000
narrower: http://cv.iptc.org/newscodes/subjectcode/06005000
narrower: http://cv.iptc.org/newscodes/subjectcode/06006000
narrower: http://cv.iptc.org/newscodes/subjectcode/06007000
narrower: http://cv.iptc.org/newscodes/subjectcode/06008000
narrower: http://cv.iptc.org/newscodes/subjectcode/06009000
narrower: http://cv.iptc.org/newscodes/subjectcode/06010000
narrower: http://cv.iptc.org/newscodes/subjectcode/06011000
narrower: http://cv.iptc.org/newscodes/subjectcode/06012000
narrower: http://cv.iptc.org/newscodes/subjectcode/06013000