Risparmio energetico
type: Concept
preferred label: 省エネ @ja-jp
preferred label: économies d'énergie @fr
preferred label: poupança de energia @pt-br
preferred label: energy saving @en-gb
preferred label: ahorro de energía @es
preferred label: Energieeinsparung @de
definition: Conservación de electricidad y otras fuentes de poder. @es
definition: La conservation des sources d'énergie (dont l'électricité) @fr
definition: Conservazione delle varie fonti di energia
definition: Erhaltung elektronischer und anderer Energiequellen. @de
definition: Conservação da eletricidade e de outras fontes de energia. @pt-br
definition: Conservation of electrical, and other power sources @en-gb
definition: 電気やその他の動力源の管理 @ja-jp
note: nessuno
in scheme: subjectcode
created: 2000-10-30T12:00:00+00:00
modified: 2010-12-15T17:01:09+00:00
broader: http://cv.iptc.org/newscodes/subjectcode/06000000