Inquinamento
type: Concept
preferred label: contaminación ambiental @es
preferred label: poluição ambiental @pt-pt
preferred label: Umweltverschmutzung @de
preferred label: Pollution de l'environnement @fr
preferred label: environmental pollution @en-gb
preferred label: 環境汚染 @ja-jp
definition: 有害物質による、大気、水、土地などの汚染 @ja-jp
definition: Verschmutzung von Luft, Wasser, Land etc. durch schädliche Stoffe. @de
definition: Corruption of air, water, land etc. by harmful substances @en-gb
definition: Contaminação de ar, águas, terra, etc., por substâncias nocivas. @pt-br
definition: Contaminazione di aria, acqua, terra, ecc... da parte di sostanze dannose
definition: La pollution de l'air, de l'eau, du sol, etc. par des substances toxiques @fr
definition: Contaminación del aire, aguas, tierra, etc., por sustancias dañinas.. @es
note: nessuno
in scheme: subjectcode
created: 2000-10-30T12:00:00+00:00
modified: 2010-12-15T17:01:09+00:00
broader: http://cv.iptc.org/newscodes/subjectcode/06000000
narrower: http://cv.iptc.org/newscodes/subjectcode/06005001
narrower: http://cv.iptc.org/newscodes/subjectcode/06005002