Foreste
type: Concept
preferred label: bosques @es
preferred label: Forêts @fr
preferred label: florestas @pt-pt
preferred label: forests @en-gb
preferred label: 森林 @ja-jp
preferred label: Wald @de
definition: Espaces arborés pour les loisirs du public ou dans un but commercial @fr
definition: Zonas abertas e arborizadas para divertimento público ou fins comerciais. @pt-br
definition: Aree verdi, boschi, foreste, giardini, utilizzabili per il piacere pubblico o per scopi commerciali
definition: Öffentliche Baumgebiete, die sowohl zur Erholung oder für kommerzielle Zwecke genutzt werden. @de
definition: Open areas of trees either available for public enjoyment, or for commercial purposes @en-gb
definition: 公共の楽しみ、または商業目的のために利用できる木々のオープンな区域 @ja-jp
definition: Áreas abiertas con árboles disponibles para la entretención del publico ,o para propósitos comerciales. @es
note: nessuno
in scheme: subjectcode
created: 2003-04-05T12:00:00+00:00
modified: 2012-07-10T12:00:00+00:00
broader: http://cv.iptc.org/newscodes/subjectcode/06006000