Montagne
type: Concept
preferred label: montanhas @pt-pt
preferred label: Berg @de
preferred label: Montagnes @fr
preferred label: 山 @ja-jp
preferred label: mountains @en-gb
preferred label: montañas @es
definition: Rilievi importanti del suolo formatisi nel corso delle ere. Monti, Colline, Catene montuose ecc.
definition: Relief important du sol s'élevant à une grande hauteur @fr
definition: Erhöhte Landmassen, die sich über die Jahre durch Erosion, Vulkanausbrüche, oder aus der Bewegung massiver geografischer Formationen, Platten genannt, gebildet haben. @de
definition: Elevação de terreno, formada ao longo dos tempos por erosão, erupção vulcânica ou movimento de grandes formações geográficas chamadas placas. @pt-pt
definition: 浸食と火山性噴火、またはプレートと呼ばれる巨大な地層の移動によって長年かかって形成された高地 @ja-jp
definition: Elevated land masses formed over the ages either by erosion, volcanic eruption, or movement of massive geographical formations called plates @en-gb
definition: Elevadas masas de tierra formas con en el tiempo ya sea por erosión, erupción volcánica, o movimientos de grandes formaciones geográficas llamadas placas subterráneas. @es
note: nessuno
in scheme: subjectcode
created: 2003-04-05T12:00:00+00:00
modified: 2012-07-10T12:00:00+00:00
broader: http://cv.iptc.org/newscodes/subjectcode/06006000