aquecimento global
type: Concept
preferred label: 温暖化 @ja-jp
preferred label: Globale Erwärmung @de
preferred label: global warming @en-gb
preferred label: Effetto serra @it
preferred label: calentamiento global @es
preferred label: Alerte à la pollution @fr
definition: Esta categoría incluye todos los aspectos relacionados al calentamiento global, incluyendo investigación de temperaturas, seguimiento remoto a tendencias de temperatura, debate sobre calentamiento global, vías de reducción a la emisión y comercio de carbó @es
definition: Esta categoria inclui todos os assuntos relativos ao aquecimento global, incluindo investigação de temperaturas, sensoriamento remoto de temperaturas, debate sobre o aquecimento global, formas de reduzir emissões e comércio de carbono.
definition: Riscaldamento globale della terra, ricerche sulla temperatura e sulle sue modifiche, dibattito sulla riduzione delle emissioni @it
definition: Alle Probleme, in Bezug auf die globale Erwärmung, inklusive Klimaforschung, Ferndiagnose von Temperaturentwicklungen, Debatten um die Erderwärmung und Wege die Schadstoffemission und den Kohlenstoffgehalt zu verringern. @de
definition: All issues relating to global warming including temperature research, remote sensing on temperature trends, debate on global warming, ways to reduce emissions and carbon trading. @en-gb
definition: Les questions relatives à l'alerte environnementale y compris les températures et les moyens pour réduire les émissions de CO2 @fr
definition: このカテゴリーは気温研究、気温傾向に関する遠隔検知や、地球温暖化現象に関する議論、排出量削減方法、排出権取引といった、地球温暖化現象に関連するすべての問題を含む @ja-jp
definition: Esta categoria inclui todos os assuntos relativos ao aquecimento global, incluindo investigação de temperaturas, deteção remota de temperaturas, debate sobre o aquecimento global, formas de reduzir emissões e comércio de carbono.
note: nessuno @it
in scheme: subjectcode
created: 2000-10-30T12:00:00+00:00
modified: 2010-12-15T17:01:09+00:00
broader: http://cv.iptc.org/newscodes/subjectcode/06000000