Disinquinamento
type: Concept
preferred label: 汚染除去 @ja-jp
preferred label: limpieza ambiental @es
preferred label: Dépollution @fr
preferred label: Umweltsäuberung @de
preferred label: environmental cleanup @en-gb
preferred label: limpeza ambiental @pt-br
definition: 人々あるいは動物が再び居住できるように、汚染地域から危険性物質をきれいに片づけるプロセス @ja-jp
definition: Processos através dos quais áreas contaminadas são limpas de materiais perigosos, para que possam ser novamente habitadas por pessoas ou animais. @pt-pt
definition: Procesos por los cuales las áreas contaminadas se limpian quitándoles materiales peligrosos para que así puedan volver a ser habitados por personas o por animales. @es
definition: Processi attuati per la pulizia e la decontaminazione di aree da materiale tossico
definition: Prozess bei dem verseuchte Gebiete von schädlichem Material gereinigt werden, sodass diese wieder bewohnbar sind für Menschen und Tiere. @de
definition: moyens de nettoyage et de décontamination @fr
definition: Processes whereby contaminated areas are cleaned of hazardous materials so they can be inhabited again by either people or animals. @en-gb
note: nessuno
in scheme: subjectcode
created: 2003-04-05T12:00:00+00:00
modified: 2012-07-10T12:00:00+00:00
broader: http://cv.iptc.org/newscodes/subjectcode/06000000