saúde
type: Concept
preferred label: salud @es
preferred label: Medizin, Gesundheit @de
preferred label: Santé @fr
preferred label: health @en-gb
preferred label: Salute @it
preferred label: 健康 @ja-jp
definition: Todos os aspetos relativos ao bem-estar físico e mental dos seres humanos.
definition: Alle Aspekte des körperlichen und geistigen Wohlbefindens von Menschen. @de
definition: Todos os aspectos relativos ao bem-estar físico e mental dos seres humanos.
definition: 人間の身体または精神的な厚生に関するすべての局面 @ja-jp
definition: All aspects pertaining to the physical and mental welfare of human beings. @en-gb
definition: Todos los aspectos pertinentes al bienestar psicológico y mental de los seres humanos. @es
definition: Conseguimento e mantenimento del buono stato psicofisico della persona, ma anche degli altri esseri viventi @it
definition: Etat physique et mental des organismes vivants @fr
note: nessuno @it
in scheme: subjectcode
created: 2000-10-30T12:00:00+00:00
modified: 2010-12-15T17:01:09+00:00
narrower: http://cv.iptc.org/newscodes/subjectcode/07001000
narrower: http://cv.iptc.org/newscodes/subjectcode/07002000
narrower: http://cv.iptc.org/newscodes/subjectcode/07003000
narrower: http://cv.iptc.org/newscodes/subjectcode/07004000
narrower: http://cv.iptc.org/newscodes/subjectcode/07005000
narrower: http://cv.iptc.org/newscodes/subjectcode/07006000
narrower: http://cv.iptc.org/newscodes/subjectcode/07007000
narrower: http://cv.iptc.org/newscodes/subjectcode/07008000
narrower: http://cv.iptc.org/newscodes/subjectcode/07009000
narrower: http://cv.iptc.org/newscodes/subjectcode/07010000
narrower: http://cv.iptc.org/newscodes/subjectcode/07011000
narrower: http://cv.iptc.org/newscodes/subjectcode/07012000
narrower: http://cv.iptc.org/newscodes/subjectcode/07013000
narrower: http://cv.iptc.org/newscodes/subjectcode/07014000
narrower: http://cv.iptc.org/newscodes/subjectcode/07015000
narrower: http://cv.iptc.org/newscodes/subjectcode/07016000
narrower: http://cv.iptc.org/newscodes/subjectcode/07017000
narrower: http://cv.iptc.org/newscodes/subjectcode/07018000
narrower: http://cv.iptc.org/newscodes/subjectcode/07019000