Contagiosa
type: Concept
preferred label: Ansteckende Krankheit @de
preferred label: doenças contagiosas @pt-br
preferred label: Maladies contagieuses @fr
preferred label: communicable diseases @en-gb
preferred label: 伝染病 @ja-jp
preferred label: enfermedades contagiosas @es
definition: Malattia trasmissibile da una persona o animale ad un'altra/o
definition: Krankheiten, die von einem Menschen oder Tier zu einem anderen übertragen werden können. @de
definition: Maladie transmissible d'un individu (homme ou animal) à l'autre @fr
definition: Doenças que podem ser transmitidas de um indivíduo (pessoa ou animal) a outro. @pt-pt
definition: Diseases that can be transmitted from one person or animal to another @en-gb
definition: 人や動物から伝染がありうる病気 @ja-jp
definition: Enfermedades que se pueden transmitir de una persona o animal a otra. @es
note: nessuno
in scheme: subjectcode
created: 2003-04-05T12:00:00+00:00
modified: 2012-07-10T12:00:00+00:00
broader: http://cv.iptc.org/newscodes/subjectcode/07001000