Cardiache
type: Concept
preferred label: Herzkrankheit @de
preferred label: doenças cardíacas @pt-br
preferred label: Maladie cardiaque @fr
preferred label: heart disease @en-gb
preferred label: 心臓病 @ja-jp
preferred label: enfermedades cardíacas @es
definition: Malattie riguardanti il cuore ed il sistema cardiocircolatorio; infarto, ostruzione dei vasi ecc.
definition: Eine verbreitete und ernsthafte Krankheit, verursacht durch die Verengung der Gefäße, die das Herz versorgen. @de
definition: Doença degenerativa grave causada pelo estreitamento das artérias que alimentam o coração. @pt-br
definition: A degenerative and serious disease caused by narrowing of the arteries feeding the heart @en-gb
definition: Enfermedad grave y degenerativa causada por la obstrucción de las arterias que llegan al corazón. @es
definition: Maladie dégénérative provoquée par le rétrécissement des artères @fr
definition: 深刻かつ退行的な病気。心臓に血液を送っている動脈が狭まることによって起こる @ja-jp
note: nessuno
in scheme: subjectcode
created: 2003-04-05T12:00:00+00:00
modified: 2012-07-10T12:00:00+00:00
broader: http://cv.iptc.org/newscodes/subjectcode/07001000