Farmaci su ricetta medica
type: Concept
preferred label: medicamentos @pt-br
preferred label: prescription drugs @en-gb
preferred label: medicamento bajo prescripción médica @es
preferred label: Prescription médicale @fr
preferred label: 処方 @ja-jp
preferred label: Droge auf Rezept @de
definition: Medicinali acquistabili solo dietro prescrizione da parte del medico
definition: Drugs that can be purchased only with a doctor's authorization @en-gb
definition: Drogas que só podem ser compradas com autorização médica. @pt-br
definition: 医師の発行した処方箋がないと購入できない薬剤 @ja-jp
definition: Drogas que solo se pueden comprar con la autorización de un doctor. @es
definition: Drogen, die ausschließlich mit der Erlaubnis des Arztes verabreicht werden dürfen. @de
definition: Médicaments ou drogues ne pouvant être achetés que sur ordonnance du médecin @fr
note: nessuno
in scheme: subjectcode
created: 2003-04-05T12:00:00+00:00
modified: 2012-07-10T12:00:00+00:00
broader: http://cv.iptc.org/newscodes/subjectcode/07003000