Dieta
type: Concept
preferred label: diet @en-gb
preferred label: dieta @pt-br
preferred label: Régime @fr
preferred label: ダイエット @ja-jp
preferred label: Diät @de
definition: Regime alimentare controllato
definition: Kontrollierter Konsum von Nahrungsmitteln. @de
definition: Controlled food consumption @en-gb
definition: Contrôle de la consommation d'aliments @fr
definition: Consumo controlado de comida. @pt-pt
definition: 食事量を制限すること @ja-jp
note: nessuno
in scheme: subjectcode
created: 2004-10-13T12:00:00+00:00
modified: 2012-07-10T12:00:00+00:00
broader: http://cv.iptc.org/newscodes/subjectcode/07003000