Ricerca medica
type: Concept
preferred label: investigación médica @es
preferred label: investigação médica @pt-br
preferred label: Recherche médicale @fr
preferred label: 医療研究 @ja-jp
preferred label: Medizinische Forschung @de
preferred label: medical research @en-gb
definition: Ursache- und Therapieforschung bei Krankheiten. @de
definition: Investigação sobre causas e curas de doenças. @pt-br
definition: La recherche sur les causes des maladies et sur leur traitement @fr
definition: Investigation into the causes and cures of diseases @en-gb
definition: Ricerca applicata specificatamente sulla natura delle malattie e le loro cause e sul progresso nella cura di esse
definition: 病気の原因および治療法の調査 @ja-jp
definition: Investigación acerca de las causas y curas de enfermedades. @es
note: nessuno
in scheme: subjectcode
created: 2000-10-30T12:00:00+00:00
modified: 2010-12-15T17:01:09+00:00
broader: http://cv.iptc.org/newscodes/subjectcode/07000000