Personale medico
type: Concept
preferred label: medical staff @en-gb
preferred label: profissionais de saúde @pt-br
preferred label: Personnel médical @fr
preferred label: Gesundheitspersonal @de
preferred label: personal médico @es
preferred label: 医療従事者 @ja-jp
definition: Ärzte und Pflegepersonal, innerhalb und außerhalb einer medizinischen Einrichtung. @de
definition: Dottori, infermieri, medici interni e altri che operano in una struttura medica
definition: Médicos, enfermeiros e outros profissionais que trabalham em instalações médicas. @pt-pt
definition: Les médecins, infirmiers aide-soignants, etc. travaillant dans des installations médicales @fr
definition: Doctors, nurses, interns and others in a medical facility @en-gb
definition: 医療施設の医師、看護師、インターンと他の医療スタッフ @ja-jp
definition: Dcotores, efermeras, internistas y otros en una dependencia medica. @es
note: nessuno
in scheme: subjectcode
created: 2000-10-30T12:00:00+00:00
modified: 2010-12-15T17:01:09+00:00
broader: http://cv.iptc.org/newscodes/subjectcode/07000000
narrower: http://cv.iptc.org/newscodes/subjectcode/07006001
narrower: http://cv.iptc.org/newscodes/subjectcode/07006002