Sindacati Sanità
type: Concept
preferred label: sindicatos da saúde @pt-br
preferred label: health-workers union @en-gb
preferred label: 医療従事者組合 @ja-jp
preferred label: Gewerkschaft für medizinische Berufe @de
definition: Organizzazioni e attività sindacali riguardanti i lavoratori del comparto Sanità
definition: 医師、看護師、ヘルスワーカーなどの組合に関する問題 @ja-jp
definition: Questões envolvendo grupos de médicos, enfermeiros, trabalhadores da saúde, etc. @pt-br
definition: Issues involving industry groups for doctors, nurses, health workers etc. @en-gb
definition: Fragen, die sich auf organisierte Vertretungen für Ärzte, Schwestern und Pflegepersonal beziehen. @de
note: nessuno
in scheme: subjectcode
created: 2006-08-21T12:00:00+00:00
modified: 2012-07-10T12:00:00+00:00
broad match: http://cv.iptc.org/newscodes/mediatopic/20000536
broader: http://cv.iptc.org/newscodes/subjectcode/07006000