Medicina
type: Concept
preferred label: Medizin/Medikament @de
preferred label: medicine @en-gb
preferred label: medicina @pt-br
preferred label: 医薬品 @ja-jp
preferred label: medicamentos @es
preferred label: Médicaments @fr
definition: 病気または体調不良を除去するために使用される物質 @ja-jp
definition: Remèdes pris pour éliminer la maladie @fr
definition: Sustancia que es administrada con intencion de eliminar un mal o enfermedad. @es
definition: A substance used with the expectation that it will eliminate disease or illness @en-gb
definition: Substância administrada com intenção de eliminar uma afecção ou doença. @pt-br
definition: Substância administrada com intenção de eliminar uma afeção ou doença. @pt-pt
definition: Ein Mittel, das verabreicht wird in der Hoffnung ein Leiden oder eine Krankheit zu heilen. @de
definition: Sostanza o trattamento usato con l'aspettativa che possa eliminare un'infermità o una malattia
note: nessuno
in scheme: subjectcode
created: 2000-10-30T12:00:00+00:00
modified: 2010-12-15T17:01:09+00:00
broader: http://cv.iptc.org/newscodes/subjectcode/07000000
narrower: http://cv.iptc.org/newscodes/subjectcode/07007001
narrower: http://cv.iptc.org/newscodes/subjectcode/07007002
narrower: http://cv.iptc.org/newscodes/subjectcode/07007003
narrower: http://cv.iptc.org/newscodes/subjectcode/07007004