Olistica
type: Concept
preferred label: 全人的医療 @ja-jp
preferred label: holística @pt-pt
preferred label: holistic @en-gb
preferred label: Ganzheitliche Medizin @de
preferred label: holísticos @es
preferred label: Médecine holistique @fr
definition: Tratado sobre la persona completa, incluyendo factores mentales, sociales más allá de sólo los síntomas de una enfermedad. @es
definition: Trattamento che considera il paziente come un intero, inclusi i fattori mentali e sociali, e non solo sulla base dei sintomi
definition: 病気による症状よりも精神的、社会的な要因を含む人に対する全体的な治療 @ja-jp
definition: Médecine qui traite le patient comme un tout et pas seulement en fonction des symptômes @fr
definition: Tratamento da pessoa como um todo, incluindo fatores mentais e sociais, e não somente os sintomas da doença. @pt-br
definition: Treatment of the whole person including mental and social factors rather than just the symptoms of the disease. @en-gb
definition: Behandlung der gesamten Person, unter Einbeziehung mentaler und sozialer Faktoren, eher als die Krankheitssymptome selbst. @de
note: nessuno
in scheme: subjectcode
created: 2000-10-30T12:00:00+00:00
modified: 2010-12-15T17:01:09+00:00
broader: http://cv.iptc.org/newscodes/subjectcode/07007000