Medicina preventiva
type: Concept
preferred label: medicina preventiva @es
preferred label: Vorsorge @de
preferred label: preventative medicine @en-gb
preferred label: Médecine préventive @fr
preferred label: 予防薬 @ja-jp
definition: Sustancias utilizadas para prevenir males y enfermedades. @es
definition: Substances used to prevent diseases or illnesses @en-gb
definition: Substâncias usadas para prevenir afeções ou doenças. @pt-pt
definition: Substâncias usadas para prevenir afecções ou doenças. @pt-br
definition: Uso dei rimedi per prevenire l'insorgenza di infermità o malattie
definition: Stoffe, die zur Vorbeugung von Krankheiten genutzt werden. @de
definition: Remèdes utiliser pour prévenir les maladies @fr
definition: 病気または体調不良を予防するために使用される物質 @ja-jp
note: nessuno
in scheme: subjectcode
created: 2000-10-30T12:00:00+00:00
modified: 2010-12-15T17:01:09+00:00
broader: http://cv.iptc.org/newscodes/subjectcode/07000000
narrower: http://cv.iptc.org/newscodes/subjectcode/07008001