serviço nacional de saúde
type: Concept
preferred label: atención estatal de salud @es
preferred label: government health care @en-gb
preferred label: Servizio Sanitario Nazionale @it
preferred label: 保健所 @ja-jp
preferred label: Santé publique @fr
preferred label: Staatliche Gesundheitsfürsorge @de
definition: Le programme de santé publique @fr
definition: Cuidado de la salud a cargo de gobiernos nacionales. @es
definition: 国家政府によって提供された健康管理 @ja-jp
definition: Cuidados de saúde fornecidos pelos governos nacionais.
definition: Sistema de saúde assegurado pelo estado.
definition: Health care provided by national governments @en-gb
definition: Sistema sanitario pubblico garantito dallo Stato; Programma pubblico per la salute @it
definition: Gesundheitsfürsorge, die von der Regierung unterstützt wird. @de
note: nessuno @it
in scheme: subjectcode
created: 2000-10-30T12:00:00+00:00
modified: 2010-12-15T17:01:09+00:00
broader: http://cv.iptc.org/newscodes/subjectcode/07000000
narrower: http://cv.iptc.org/newscodes/subjectcode/07011001
narrower: http://cv.iptc.org/newscodes/subjectcode/07011002