Medicare
type: Concept
preferred label: 高齢者医療保険制度 @ja-jp
preferred label: salud pública para jubilados en eeuu @es
preferred label: medicare @pt-br
preferred label: Pflegeversicherung @de
definition: A program of the U.S. government to provide health care to senior citizens @en-gb
definition: 米政府による高齢者に対する医療保険制度 @ja-jp
definition: Aux USA, programme gouvernemental de santé à destination des personnes âgées et des handicapés @fr
definition: Programa do governo norte-americano para fornecer cuidados de saúde a cidadãos idosos. @pt-pt
definition: Programa del gobierno de Estados Unidos para brindar atención de salud al adulto mayor. @es
definition: Staatliche Gesundheitsversorgung von älteren Menschen. @de
definition: Specifico programma del governo USA di assistenza sanitaria agli anziani e ai portatori di handicap
note: nessuno
in scheme: subjectcode
created: 2003-04-05T12:00:00+00:00
modified: 2012-07-10T12:00:00+00:00
broad match: http://cv.iptc.org/newscodes/mediatopic/20000480
broader: http://cv.iptc.org/newscodes/subjectcode/07011000