低所得者医療扶助制度
type: Concept
preferred label: medicaid @en-gb
preferred label: salud pública en eeuu @es
preferred label: Medicaid @fr
preferred label: Staatliche Krankenversicherung @de
definition: Programa del gobierno de Estados Unidos para brindar atención de salud a ciudadanos de escaso recursos de todas las edades. @es
definition: 米政府によるすべての年齢の貧困者に対する医療扶助制度
definition: Programa do governo norte-americano para fornecer cuidados de saúde a cidadãos carenciados de todas as idades. @pt-pt
definition: Aux USA, programme gouvernemental d'aide médicale aux plus pauvres @fr
definition: Programa do governo norte-americano para fornecer cuidados de saúde a cidadãos necessitados de todas as idades. @pt-br
definition: Staatliche Gesundheitsversorgung von Menschen aller Altersgruppen. @de
definition: A program of the U.S. government to provide health care to needy citizens of all ages @en-gb
definition: Specifico programma del governo USA di assistenza sanitaria ai cittadini bisognosi @it
note: nessuno @it
in scheme: subjectcode
created: 2003-04-05T12:00:00+00:00
modified: 2012-07-10T12:00:00+00:00
broad match: http://cv.iptc.org/newscodes/mediatopic/20000480
broader: http://cv.iptc.org/newscodes/subjectcode/07011000