Ginecologia, Ostetricia
type: Concept
preferred label: -- @es
preferred label: Gynécologie @fr
preferred label: 産婦人科 @ja-jp
preferred label: obstetrícia/ginecologia @pt-pt
preferred label: Gynäkologie @de
preferred label: obstetrics/gynecology @en-gb
definition: Specialty of female reproductive organs @en-gb
definition: Krankheiten der weiblichen Sexual- und Fortpflanzungsorgane. @de
definition: Especialidade médica que se ocupa dos órgãos reprodutores femininos. @pt-pt
definition: -- @es
definition: 女性生殖器の専門 @ja-jp
definition: Spécialité de la médecine concernant les femmes @fr
definition: Medicina dell'apparato riproduttivo femminile, della fecondazione, gestazione e parto
note: nessuno
in scheme: subjectcode
created: 2004-10-13T12:00:00+00:00
modified: 2012-07-10T12:00:00+00:00
broader: http://cv.iptc.org/newscodes/subjectcode/07014000