Forma fisica
type: Concept
preferred label: 体力 @ja-jp
preferred label: Etat physique @fr
preferred label: physical fitness @en-gb
preferred label: estado físico @es
preferred label: condição física @pt-br
preferred label: Fitness @de
definition: L'état de santé cardio-vasculaire et musculaire @fr
definition: Condición cardiovascular y muscular de una persona. @es
definition: Kondition in Bezug auf die Gesundheit des Herz-Kreislauf-Systems und der Muskulatur. @de
definition: Condição cardiovascular e muscular de uma pessoa. @pt-br
definition: The condition of a person's cardio-vascular and muscular health. @en-gb
definition: Condizioni di salute di una persona a livello cardiovascolare e muscolare
definition: 人の持久力や筋力などの状態 @ja-jp
note: nessuno
in scheme: subjectcode
created: 2003-04-05T12:00:00+00:00
modified: 2012-07-10T12:00:00+00:00
broader: http://cv.iptc.org/newscodes/subjectcode/07000000