obesidade
type: Concept
preferred label: Übergewicht @de
preferred label: Obésité @fr
preferred label: obesidad @es
preferred label: Obesità @it
preferred label: 肥満 @ja-jp
preferred label: obesity @en-gb
definition: Condição do peso corporal considerada geralmente 20% acima do normal para o gênero, idade, altura e estrutura óssea.
definition: Zustand des Körpergewichts, der 20 Prozent über dem Normalgewicht liegt, je nach Geschlecht, Alter und Größe und Körperbau. @de
definition: Masse corporelle généralement supérieur à 20% de la normale en fonction du sexe, de l'âge, de la taille et de la structure osseuse @fr
definition: Condizione del peso corporeo generalmente considerata in ordine al 20 % al di sopra della norma per quanto riguarda sesso, età, peso e struttura ossea @it
definition: Una condición del peso corporal considerada generalmente 20 por ciento sobre lo normal para el género, la edad, la altura y la estructura del hueso @es
definition: Condição do peso corporal considerada geralmente 20% acima do normal para o género, idade, altura e estrutura óssea.
definition: 性別、年齢、身長、および骨格の標準より、一般に体重が20パーセント重い状態 @ja-jp
definition: A condition of body weight generally considered 20 percent above the norm for gender, age, height and bone structure @en-gb
note: nessuno @it
in scheme: subjectcode
created: 2004-10-13T12:00:00+00:00
modified: 2012-07-10T12:00:00+00:00
broader: http://cv.iptc.org/newscodes/subjectcode/07017000