Condizioni mediche
type: Concept
preferred label: 症状 @ja-jp
preferred label: Medizinischer Zustand @de
preferred label: condiciones médicas @es
preferred label: medical conditions @en-gb
preferred label: condição médica @pt-br
preferred label: Etat de santé @fr
definition: Estados de evolução de doenças ou feridas. @pt-br
definition: Verschiedene Stadien von Krankheit, Leiden oder Verletzung. @de
definition: Various stages of disease, illness or injury @en-gb
definition: Varias etapas de una nfermedad, malestar o de lesión @es
definition: Vari stadi dell'evoluzione delle malattie o degli stati di infermità
definition: Etats de l'évolution des maladies ou des blessures @fr
definition: 病気、体調不良、傷害のさまざまな状態 @ja-jp
note: nessuno
in scheme: subjectcode
created: 2004-10-13T12:00:00+00:00
modified: 2012-07-10T12:00:00+00:00
broader: http://cv.iptc.org/newscodes/subjectcode/07000000