animais
type: Concept
preferred label: Animaux @fr
preferred label: animales @es
preferred label: animal @en-gb
preferred label: Animali @it
preferred label: 動物 @ja-jp
preferred label: Tier @de
definition: Les histoires d'animaux @fr
definition: すべての種類の動物に関する記事 @ja-jp
definition: historias que envuelven a animales de todos clases. @es
definition: Histórias envolvendo animais de qualquer tipo.
definition: Histórias envolvendo animais de todo tipo.
definition: Tiere aller Arten @de
definition: Argomenti riguardanti gli animali di tutti i tipi @it
definition: Animals of all types @en-gb
note: nessuno @it
in scheme: subjectcode
created: 2000-10-30T12:00:00+00:00
modified: 2010-12-15T17:01:09+00:00
broader: http://cv.iptc.org/newscodes/subjectcode/08000000