Persone
type: Concept
preferred label: pessoas @pt-pt
preferred label: gente @es
preferred label: 人々 @ja-jp
preferred label: people @en-gb
preferred label: Gens @fr
preferred label: Leute @de
definition: Unusual content about people of all levels @en-gb
definition: あらゆる地位にある人間についての常ならぬ話 @ja-jp
definition: Usualmente, historias acerca de personas de todas clases. @es
definition: Argomenti insoliti sulle persone
definition: Außergewöhnliche Inhalte über Personen auf allen Ebenen. @de
definition: Les histoires insolites sur les gens @fr
definition: Histórias insólitas sobre pessoas de todos os níveis. @pt-br
note: nessuno
in scheme: subjectcode
created: 2000-10-30T12:00:00+00:00
modified: 2010-12-15T17:01:09+00:00
broader: http://cv.iptc.org/newscodes/subjectcode/08000000
narrower: http://cv.iptc.org/newscodes/subjectcode/08003001
narrower: http://cv.iptc.org/newscodes/subjectcode/08003002
narrower: http://cv.iptc.org/newscodes/subjectcode/08003003
narrower: http://cv.iptc.org/newscodes/subjectcode/08003004
narrower: http://cv.iptc.org/newscodes/subjectcode/08003005