Celebrità
type: Concept
preferred label: Célébrités @fr
preferred label: celebrity @en-gb
preferred label: 有名人 @ja-jp
preferred label: celebridades @es
preferred label: Prominente @de
definition: Vicende di celebrità e di gossip
definition: 有名人についてのニュース。つまり、マドンナが赤んぼうを身ごもった。エルトン･ジョンが、彼の会計係を告訴した等 @ja-jp
definition: Notícias sobre celebridades. @pt-br
definition: Celebrity news, i.e. Madonna has a baby, Elton John sues his accountants etc. @en-gb
definition: Notícias sobre pessoas famosas. @pt-pt
definition: Berühmtheiten-Nachrichten, wie z.B Madonnas Baby. @de
definition: Noticias sobre celebridades como Madonna tiene un hijo, Elton John demanda a sus contadores, etc. @es
definition: Les histoires sur les célébrités, vedettes @fr
note: nessuno
in scheme: subjectcode
created: 2000-10-30T12:00:00+00:00
modified: 2010-12-15T17:01:09+00:00
broader: http://cv.iptc.org/newscodes/subjectcode/08003000