Mistero
type: Concept
preferred label: Mysteriöses @de
preferred label: ésotérisme @fr
preferred label: misterios @es
preferred label: mistérios (oculto) @pt-br
preferred label: 謎 @ja-jp
preferred label: mystery @en-gb
definition: Algo inexplicável ou desconhecido. @pt-br
definition: Algo inexplicable o desconocido. @es
definition: 説明のつかないもの、あるいは未知のもの @ja-jp
definition: Choses inexpliquées ou inconnues @fr
definition: Something unexplained or unknown @en-gb
definition: Temi riguardanti il mondo dell'inesplicabile e dello sconosciuto
definition: Etwas Unbekanntes oder Unerklärbares. @de
note: nessuno
in scheme: subjectcode
created: 2000-10-30T12:00:00+00:00
modified: 2010-12-15T17:01:09+00:00
broader: http://cv.iptc.org/newscodes/subjectcode/08000000
broad match: http://cv.iptc.org/newscodes/mediatopic/08000000