funeral
type: Concept
preferred label: Funerali @it
preferred label: Beerdigung @de
preferred label: 葬儀 @ja-jp
definition: 遺体を埋葬するための儀式 @ja-jp
definition: Cerimonie di esequie e sepoltura @it
definition: Cerimónia de sepultamento dos restos mortais de uma pessoa.
definition: Zeremonie zur Bestattung eines Menschen. @de
definition: The ceremony to intern the remains of a person @en-gb
definition: Cerimônia de sepultamento dos restos mortais de uma pessoa.
note: nessuno @it
in scheme: subjectcode
created: 2006-08-21T12:00:00+00:00
modified: 2012-07-10T12:00:00+00:00
broader: http://cv.iptc.org/newscodes/subjectcode/08005000
broad match: http://cv.iptc.org/newscodes/mediatopic/08000000