doação de património
type: Concept
preferred label: Erbschaft @de
preferred label: estate bestowal @en-gb
preferred label: Testamenti, Eredità @it
preferred label: doação de patrimônio
preferred label: 財産分与 @ja-jp
definition: Distribuição do património de uma pessoa de acordo com a sua vontade.
definition: Questioni testamentarie e riguardanti l'eredità di una persona: esecuzioni, disaccordi fra gli eredi ecc. @it
definition: The distribution of the estate of a person according to their will and any disagreements between the heirs @en-gb
definition: 故人の遺志あるいは相続者間の争いに基づく財産の分配 @ja-jp
definition: Distribuição do patrimônio de uma pessoa de acordo com sua vontade.
definition: Die Verteilung des Besitzes einer Person nach ihrem Willen und die Streitigkeiten der Angehörigen. @de
note: nessuno @it
in scheme: subjectcode
created: 2006-08-21T12:00:00+00:00
modified: 2012-07-10T12:00:00+00:00
broader: http://cv.iptc.org/newscodes/subjectcode/08005000
broad match: http://cv.iptc.org/newscodes/mediatopic/08000000