Case reali
type: Concept
preferred label: imperial and royal matters @en-gb
preferred label: Royauté @fr
preferred label: realeza @pt-pt
preferred label: 皇室・王室 @ja-jp
preferred label: Adel @de
preferred label: asuntos imperiales, reales @es
definition: Notícias sobre membros de famílias reais e imperiais, incluindo assuntos de sistemas legais. @pt-br
definition: Temi riguardanti membri di famiglie reali o imperiali
definition: Noticias de los miembros de familias reales e imperiales, incluyendo asuntos de sistemas legales. @es
definition: Les informations sur les membres de familles royales et impériales @fr
definition: Imperial and royal family members, including matters on legal systems. @en-gb
definition: 法制度に関する事項を含む、皇室と王室メンバーについてのニュース @ja-jp
definition: Adelige oder Angehörige von Königsfamilien, inklusive Angelegenheiten amtierender Königshäuser. @de
note: nessuno
in scheme: subjectcode
created: 2000-10-30T12:00:00+00:00
modified: 2010-12-15T17:01:09+00:00
broader: http://cv.iptc.org/newscodes/subjectcode/08000000