estagiários e aprendizes
type: Concept
preferred label: 職業訓練 @ja-jp
preferred label: apprentices @en-gb
preferred label: aprendices @es
preferred label: Apprentissage @fr
preferred label: Apprendistato @it
preferred label: Ausbildung/Lehrstelle @de
definition: Salariés qui apprennent un métier sous la direction d'un patron @fr
definition: Attività di formazione lavoro @it
definition: Personas que forman parte de uanfuerza de trabajo en el nivel inicial, sirviendo bajo un maestro. @es
definition: Menschen, die sich lernend im Arbeitsprozess befinden und von einem Ausbilder betreut werden. @de
definition: People who are in the work force at a learning level, serving under a master @en-gb
definition: Pessoas que fazem parte de uma força de trabalho num nível inicial, aprendendo a profissão sob a direção de alguém.
definition: 雇い主の下で働き、労働力の中において習得段階にある人々 @ja-jp
definition: Pessoas que fazem parte de uma força de trabalho em nível inicial, aprendendo a profissão sob a direção de alguém.
note: nessuno @it
in scheme: subjectcode
created: 2000-10-30T12:00:00+00:00
modified: 2010-12-15T17:01:09+00:00
broader: http://cv.iptc.org/newscodes/subjectcode/09000000