despedimentos
type: Concept
preferred label: 一時解雇 @ja-jp
preferred label: Personalabbau @de
preferred label: demissões
preferred label: job layoffs @en-gb
preferred label: Plan social @fr
preferred label: despidos @es
preferred label: Licenziamento @it
definition: Die Reduzierung von Arbeit innerhalb einer Firma durch Entlassungen aufgrund sich ändernder wirtschaftlicher Bedingungen. @de
definition: La diminution du nombre de salariés d'une entreprise par licenciement en raison du changement de la situation économique @fr
definition: 経済的な要因の変化によって生じる企業力衰退による解雇 @ja-jp
definition: Redução da força de trabalho de uma empresa, através de despedimento por alterações de fatores económicos.
definition: The reduction of a company's work force through dismissal because of changing economic factors @en-gb
definition: Reducción de la fuerza laboral de una empresa por medio del despido debido al cambio de factores económicos. @es
definition: Riduzione della forza lavoro a causa del cambiamento di fattori economici @it
note: nessuno @it
in scheme: subjectcode
created: 2003-04-05T12:00:00+00:00
modified: 2012-07-10T12:00:00+00:00
broader: http://cv.iptc.org/newscodes/subjectcode/09003000