Lavoro minorile
type: Concept
preferred label: Travail des enfants @fr
preferred label: trabajo infantil @es
preferred label: trabalho infantil @pt-br
preferred label: child labor @en-gb
preferred label: Kinderarbeit @de
preferred label: 少年労働 @ja-jp
definition: 通常、18歳以下の雇用 @ja-jp
definition: Beschäftigung von Kindern meistens unter 18 Jahre. @de
definition: Niños que trabajan, generalmente menores de 18 años. @es
definition: Trabalho de crianças, geralmente com menos de 18 anos. @pt-br
definition: Lavoro esercitato da minori di 18 anni di età
definition: Employment of children, usually under the age of 18 @en-gb
definition: Le travail des enfants, généralement les moins de 18 ans @fr
note: nessuno
in scheme: subjectcode
created: 2003-04-05T12:00:00+00:00
modified: 2012-07-10T12:00:00+00:00
broader: http://cv.iptc.org/newscodes/subjectcode/09003000