Riqualificazione
type: Concept
preferred label: reconversão (profissional) @pt-pt
preferred label: Reconversion @fr
preferred label: Umschulung @de
preferred label: 再訓練 @ja-jp
preferred label: recapacitación @es
preferred label: retraining @en-gb
definition: 古びた技量がもはや適用可能でない場合に、新しい技術の労働者トレーニングを提供すること @ja-jp
definition: Maßnahme, um neue Sachkenntnisse zu erwerben, wenn die bestehenden nicht mehr länger verwendbar sind. @de
definition: Acquisizione da parte del lavoratore di nuove competenze, anche per mezzo di attività di tirocinio
definition: Proveer a los empleados de nuevos conocimientos cuando sus oficios se convienten en obsoletos. @es
definition: Providing a worker training in new skills when his old skills are no longer applicable @en-gb
definition: Dotar um trabalhador de novos conhecimentos e competências quando os antigos já não são aplicáveis. @pt-pt
definition: L'acquisition de nouvelles compétences @fr
note: nessuno
in scheme: subjectcode
created: 2000-10-30T12:00:00+00:00
modified: 2010-12-15T17:01:09+00:00
broader: http://cv.iptc.org/newscodes/subjectcode/09000000