Tirocinio avanzato
type: Concept
preferred label: capacitación especializada @es
preferred label: advanced training @en-gb
preferred label: 専門教育 @ja-jp
preferred label: Berufliche Weiterbildung / Fortbildung @de
preferred label: formação profissional @pt-pt
preferred label: Formation continue @fr
definition: Formation supplémentaire dans le but de renforcer les aptitudes @fr
definition: Formazione supplementare per il miglioramento delle competenze
definition: Formação adicional para melhorar as competências de um trabalhador. @pt-br
definition: さらに技能を高めるための訓練 @ja-jp
definition: Ergänzende Maßnahmen, um aktuelle Sachkenntnisse zu erwerben. @de
definition: Entrenamiento adicional para mejorar la qualidades de un empleado. @es
definition: Additional training to enhance current skills @en-gb
note: nessuno
in scheme: subjectcode
created: 2000-10-30T12:00:00+00:00
modified: 2010-12-15T17:01:09+00:00
broader: http://cv.iptc.org/newscodes/subjectcode/09000000