Datore lavoro
type: Concept
preferred label: employer @en-gb
preferred label: 雇用者 @ja-jp
preferred label: empregador @pt-br
preferred label: Arbeitgeber @de
preferred label: empleadores @es
preferred label: Employeurs @fr
definition: La persona que emplea a los @es
definition: La personne qui emploie des employés, paie les salaires et autres avantages sociaux @fr
definition: 労働者を雇い、給料やその他の手当てなどを支給する者 @ja-jp
definition: Derjenige, der Arbeiter beschäftigt und ihre Löhne und andere Vergütungen zahlt. @de
definition: Pessoa que emprega trabalhadores e paga salários e outros benefícios. @pt-br
definition: The person who employs workers and pays the salaries and other benefits to workers @en-gb
definition: Chi dà lavoro, paga i salari e le altre competenze dovute
note: nessuno
in scheme: subjectcode
created: 2000-10-30T12:00:00+00:00
modified: 2010-12-15T17:01:09+00:00
broader: http://cv.iptc.org/newscodes/subjectcode/09000000